[sr #107636] gnutls 2.12.0 Fails to build

Marius Schamschula INVALID.NOREPLY at gnu.org
Fri Mar 25 17:43:01 CET 2011


                 Summary: gnutls 2.12.0 Fails to build
                 Project: GnuTLS
            Submitted by: mschamschula
            Submitted on: Fri 25 Mar 2011 04:43:00 PM GMT
                Category: None
                Priority: 5 - Normal
                Severity: 3 - Normal
                  Status: None
                 Privacy: Public
             Assigned to: None
        Originator Email: 
             Open/Closed: Open
         Discussion Lock: Any
        Operating System: Mac OS



While building gnutls 2.12.0 under Mac OS X 10.6.7 I get the following error:

make[4]: Entering directory `/private/tmp/gnutls-2.12.0/libextra'
  CCLD   libgnutls-extra.la
/usr/bin/nm: no name list
ld: duplicate symbol _ext_mod_ia in .libs/ext_inner_application.o and
collect2: ld returned 1 exit status
make[4]: *** [libgnutls-extra.la] Error 1
make[4]: Leaving directory `/private/tmp/gnutls-2.12.0/libextra'
make[3]: *** [all-recursive] Error 1
make[3]: Leaving directory `/private/tmp/gnutls-2.12.0/libextra'
make[2]: *** [all] Error 2
make[2]: Leaving directory `/private/tmp/gnutls-2.12.0/libextra'
make[1]: *** [all-recursive] Error 1
make[1]: Leaving directory `/private/tmp/gnutls-2.12.0'
make: *** [all] Error 2


Reply to this item at:


  Message sent via/by Savannah

More information about the Gnutls-devel mailing list