gnutls 2.11.1

Arfrever Frehtes Taifersar Arahesis arfrever.fta at
Tue Sep 14 23:05:40 CEST 2010

When GnuTLS 2.11.1 has been built with support for Nettle, then 1 test fails:

Making check in tests
make[2]: Entering directory `/var/tmp/portage/net-libs/gnutls-2.11.1/work/gnutls-2.11.1/guile/tests'
make  check-TESTS
make[3]: Entering directory `/var/tmp/portage/net-libs/gnutls-2.11.1/work/gnutls-2.11.1/guile/tests'
PASS: anonymous-auth.scm
PASS: session-record-port.scm
PASS: pkcs-import-export.scm
PASS: errors.scm
PASS: x509-certificates.scm
PASS: x509-auth.scm
PASS: openpgp-keys.scm
PASS: openpgp-keyring.scm
/bin/sh: line 5: 23938 Segmentation fault      GUILE_AUTO_COMPILE=0 ../../guile/pre-inst-guile -L . ${dir}$tst
FAIL: openpgp-auth.scm
PASS: srp-base64.scm
1 of 10 tests failed
Please report to bug-gnutls at
make[3]: *** [check-TESTS] Error 1
make[3]: Leaving directory `/var/tmp/portage/net-libs/gnutls-2.11.1/work/gnutls-2.11.1/guile/tests'
make[2]: *** [check-am] Error 2
make[2]: Leaving directory `/var/tmp/portage/net-libs/gnutls-2.11.1/work/gnutls-2.11.1/guile/tests'
make[1]: *** [check-recursive] Error 1
make[1]: Leaving directory `/var/tmp/portage/net-libs/gnutls-2.11.1/work/gnutls-2.11.1/guile'
make: *** [check-recursive] Error 1
emake failed

This problem doesn't occur when GnuTLS 2.11.1 has been built with support for libgcrypt.

Arfrever Frehtes Taifersar Arahesis
-------------- next part --------------
A non-text attachment was scrubbed...
Name: not available
Type: application/pgp-signature
Size: 836 bytes
Desc: This is a digitally signed message part.
URL: </pipermail/attachments/20100914/3d2a6133/attachment.pgp>

More information about the Gnutls-devel mailing list