GnuTLS 2.7.9 fails to build on Solaris 2.6

Tom G. Christensen tgc at
Thu May 14 20:49:52 CEST 2009

On Thu, May 14, 2009 at 01:34:39PM +0200, Simon Josefsson wrote:
> "Tom G. Christensen" <tgc at> writes:
> > I've got a new build error on Solaris 2.6:
> Thanks, should be fixed in git master now.  Please try a daily snapshot,
> a new one should be ready in a few hours.
With gnutls-20090514 it gets past the previous point only to fail later:

make[5]: Entering directory
/bin/bash ../libtool --tag=CC   --mode=compile gcc -DHAVE_CONFIG_H -I.
-I..  -I../lgl -I../lgl -I/usr/tgcware/include  -g -O2 -MT hmac-md5.lo
-MD -MP -MF .deps/hmac-md5.Tpo -c -o hmac-md5.lo hmac-md5.c
libtool: compile:  gcc -DHAVE_CONFIG_H -I. -I.. -I../lgl -I../lgl
-I/usr/tgcware/include -g -O2 -MT hmac-md5.lo -MD -MP -MF
.deps/hmac-md5.Tpo -c hmac-md5.c  -fPIC -DPIC -o .libs/hmac-md5.o
In file included from hmac-md5.c:25:
md5.h:25:20: error: stdint.h: No such file or directory
In file included from hmac-md5.c:25:
md5.h:60: error: expected specifier-qualifier-list before 'uint32_t'
make[5]: *** [hmac-md5.lo] Error 1
make[5]: Leaving directory


More information about the Gnutls-devel mailing list